{"text_format":"2","workbook":"xlsx","n_sheets":2,"sheets":["PURCHASE ORDER","CATALOG"],"not_rendered":{"charts":0,"images":2,"macros":0,"external_links":0,"defined_names":6,"comments":0,"pivot_tables":0},"unopened":[],"bounds":{"document_bytes":16777216,"sheet_cells":100000,"run_cost":"one","rows_first":2000,"rows_last":500,"rows_between":2000,"halvings":0,"cell_chars":16384,"cell_head_chars":4096},"cells_cut":0,"cells_raw":0,"read":"whole","date_system":"1900"}

{"sheet":"PURCHASE ORDER","index":0,"n_rows":117,"n_cols":9,"rows_kept":117,"cut":false,"hidden":false,"merged":[]}
[null,"              Order Form"]
[null,"Account Name: "]
[null,"Customer #: ",null,{"$f":"B3&\" \"&C3","v":"Customer #:  "}]
[null,"Contact Name: ",null,{"$f":"B4&\" \"&C4","v":"Contact Name:  "}]
[null,"Contact Phone #: ",null,{"$f":"B5&\" \"&IF(C5=\"\",\"\",TEXT(C5,\"(###) ###-####\")&IF(C6=\"\",\"\",\" Ext. \"&C6))","v":"Contact Phone #:  "}]
[null,"Contact Phone Extension: "]
[null,"Contact Email: ",null,{"$f":"B7&\" \"&C7","v":"Contact Email:  "}]
[null,"Pricing Bracket"]
[null,"Ship To Name:"]
[null,"Ship To Contact:"]
[null,"Ship To Address: "]
[null,"City, State, Zip Code:",null,{"$f":"C9&\"\n\"&C10&\"\n\"&C11&\"\n\"&C12&\"\n\"&D13","v":"\n\n\n\n"}]
[null,"Ship To Phone #:",null,{"$f":"IF(C13=\"\",\"\",TEXT(C13,\"(###) ###-####\")&IF(C14=\"\",\"\",\" Ext. \"&C14))","v":""}]
[null,"Phone Extension:"]
[null,"Order Date: ",null,{"$f":"IF(C15=\"\",B15&\" \"&TEXT(TODAY(),\"mm/dd/yyyy\"),B15&\" \"&TEXT(C15,\"mm/dd/yyyy\"))","v":"Order Date:  12/07/2025"}]
[null,"Requested Delivery Date: ",null,{"$f":"IF(C16=\"\",B16,B16&\" \"&TEXT(C16,\"mm/dd/yyyy\"))","v":"Requested Delivery Date: "}]
[null,"PO #: ",null,{"$f":"B17&\" \"&C17","v":"PO #:  "}]
[null,null,null,{"$f":"B4&\" \"&C4","v":"Contact Name:  "}]
[null,null,null,{"$f":"B5&\" \"&C5","v":"Contact Phone #:  "}]
[null,null,{"$f":"IFERROR(SUM(IF(MOD(PurchaseOrderLines[Qty],PurchaseOrderLines[Qty Increment])>0,1,0)),0)","v":0},{"$f":"B7&\" \"&C7","v":"Contact Email:  "}]
[null,null,{"$f":"COUNTIF(PurchaseOrderLines[Qty],0)+COUNTIF(PurchaseOrderLines[Qty],\"\")","v":78},{"$f":"IF(C21>1,\"This PO includes \"&TEXT(C21,\"0\")&\" lines without a quantity and is invalid.  Please add quantities to all PO Lines.\n\",IF(C21>0,\"This PO includes \"&TEXT(C21,\"0\")&\" line without a quantity and is invalid.  Please add quantities to all PO Lines.\n\",\"\"))&IF(C20>1,\"This PO includes \"&TEXT(C20,\"0\")&\" lines that do not round to even layers. Please ensure quantities round to appropriate layer quantities.\",IF(C20>0,\"This PO includes \"&TEXT(C20,\"0\")&\" line that do not round to even layers. Please ensure quantities round to appropriate layer quantities.\",\"\"))","v":"This PO includes 78 lines without a quantity and is invalid.  Please add quantities to all PO Lines.\n"}]
{"$rows_empty":13}
[{"$nulls":5},"Order Subtotal",{"$f":"SUM(PurchaseOrderLines[Total])","v":0}]
[{"$nulls":5},"Pallets",{"$f":"SUM(PurchaseOrderLines[Pallets])","v":0}]
[]
[]
[null,"Material","Description","Qty","UOM","Unit Price","Total","Qty Increment","Pallets"]
[null,{"$f":"IFERROR(VLOOKUP(ROW()-39,'CATALOG'!A:F,6,FALSE),\"\")","v":""},{"$f":"IF(PurchaseOrderLines[[#This Row],[Material]]=\"\",\"\",INDEX(Catalog[Material Description],MATCH(PurchaseOrderLines[[#This Row],[Material]],Catalog[Material '#],0)))","v":""},{"$f":"IF(PurchaseOrderLines[[#This Row],[Material]]=\"\",\"\",INDEX(Catalog[Enter Quantity To Add to PO],MATCH(PurchaseOrderLines[[#This Row],[Material]],Catalog[Material '#],0)))","v":""},{"$f":"IF(PurchaseOrderLines[[#This Row],[Material]]=\"\",\"\",INDEX(Catalog[UOM],MATCH(PurchaseOrderLines[[#This Row],[Material]],Catalog[Material '#],0)))","v":""},{"$f":"IF(PurchaseOrderLines[[#This Row],[Material]]=\"\",\"\",INDEX(Catalog[[Base]:[Efficient]],MATCH(PurchaseOrderLines[[#This Row],[Material]],Catalog[Material '#],0),MATCH(Pricing_Bracket,Catalog[[#Headers],[Base]:[Efficient]],0)))","v":""},{"$f":"IF(PurchaseOrderLines[[#This Row],[Material]]=\"\",0,PurchaseOrderLines[[#This Row],[Qty]]*PurchaseOrderLines[[#This Row],[Unit Price]])","v":0},{"$f":"IF(PurchaseOrderLines[[#This Row],[Material]]=\"\",\"\",INDEX(Catalog[MOQ/Qty Increments],MATCH(PurchaseOrderLines[[#This Row],[Material]],Catalog[Material '#],0)))","v":""},{"$f":"IFERROR(PurchaseOrderLines[[#This Row],[Qty]]/IF(PurchaseOrderLines[[#This Row],[Material]]=\"\",\"\",INDEX(Catalog[Pallet],MATCH(PurchaseOrderLines[[#This Row],[Material]],Catalog[Material '#],0))),0)","v":0}]
[null,{"$f":"IFERROR(VLOOKUP(ROW()-39,'CATALOG'!A:F,6,FALSE),\"\")","v":""},{"$f":"IF(PurchaseOrderLines[[#This Row],[Material]]=\"\",\"\",INDEX(Catalog[Material Description],MATCH(PurchaseOrderLines[[#This Row],[Material]],Catalog[Material '#],0)))","v":""},{"$f":"IF(PurchaseOrderLines[[#This Row],[Material]]=\"\",\"\",INDEX(Catalog[Enter Quantity To Add to PO],MATCH(PurchaseOrderLines[[#This Row],[Material]],Catalog[Material '#],0)))","v":""},{"$f":"IF(PurchaseOrderLines[[#This Row],[Material]]=\"\",\"\",INDEX(Catalog[UOM],MATCH(PurchaseOrderLines[[#This Row],[Material]],Catalog[Material '#],0)))","v":""},{"$f":"IF(PurchaseOrderLines[[#This Row],[Material]]=\"\",\"\",INDEX(Catalog[[Base]:[Efficient]],MATCH(PurchaseOrderLines[[#This Row],[Material]],Catalog[Material '#],0),MATCH(Pricing_Bracket,Catalog[[#Headers],[Base]:[Efficient]],0)))","v":""},{"$f":"IF(PurchaseOrderLines[[#This Row],[Material]]=\"\",0,PurchaseOrderLines[[#This Row],[Qty]]*PurchaseOrderLines[[#This Row],[Unit Price]])","v":0},{"$f":"IF(PurchaseOrderLines[[#This Row],[Material]]=\"\",\"\",INDEX(Catalog[MOQ/Qty Increments],MATCH(PurchaseOrderLines[[#This Row],[Material]],Catalog[Material '#],0)))","v":""},{"$f":"IFERROR(PurchaseOrderLines[[#This Row],[Qty]]/IF(PurchaseOrderLines[[#This Row],[Material]]=\"\",\"\",INDEX(Catalog[Pallet],MATCH(PurchaseOrderLines[[#This Row],[Material]],Catalog[Material '#],0))),0)","v":0}]
[null,{"$f":"IFERROR(VLOOKUP(ROW()-39,'CATALOG'!A:F,6,FALSE),\"\")","v":""},{"$f":"IF(PurchaseOrderLines[[#This Row],[Material]]=\"\",\"\",INDEX(Catalog[Material Description],MATCH(PurchaseOrderLines[[#This Row],[Material]],Catalog[Material '#],0)))","v":""},{"$f":"IF(PurchaseOrderLines[[#This Row],[Material]]=\"\",\"\",INDEX(Catalog[Enter Quantity To Add to PO],MATCH(PurchaseOrderLines[[#This Row],[Material]],Catalog[Material '#],0)))","v":""},{"$f":"IF(PurchaseOrderLines[[#This Row],[Material]]=\"\",\"\",INDEX(Catalog[UOM],MATCH(PurchaseOrderLines[[#This Row],[Material]],Catalog[Material '#],0)))","v":""},{"$f":"IF(PurchaseOrderLines[[#This Row],[Material]]=\"\",\"\",INDEX(Catalog[[Base]:[Efficient]],MATCH(PurchaseOrderLines[[#This Row],[Material]],Catalog[Material '#],0),MATCH(Pricing_Bracket,Catalog[[#Headers],[Base]:[Efficient]],0)))","v":""},{"$f":"IF(PurchaseOrderLines[[#This Row],[Material]]=\"\",0,PurchaseOrderLines[[#This Row],[Qty]]*PurchaseOrderLines[[#This Row],[Unit Price]])","v":0},{"$f":"IF(PurchaseOrderLines[[#This Row],[Material]]=\"\",\"\",INDEX(Catalog[MOQ/Qty Increments],MATCH(PurchaseOrderLines[[#This Row],[Material]],Catalog[Material '#],0)))","v":""},{"$f":"IFERROR(PurchaseOrderLines[[#This Row],[Qty]]/IF(PurchaseOrderLines[[#This Row],[Material]]=\"\",\"\",INDEX(Catalog[Pallet],MATCH(PurchaseOrderLines[[#This Row],[Material]],Catalog[Material '#],0))),0)","v":0}]
{"$rows_left_out":76}
{"sheet":"CATALOG","index":1,"n_rows":898,"n_cols":17,"rows_kept":898,"cut":false,"hidden":false,"merged":[]}
["Do not edit this column","Category","Brand","Description","Enter Quantity To Add to PO","Material #","Material Description","Boxes/Packs per Case","Count/Size of Box/Pack","UOM","MOQ/Qty Increments","Pallet","Pallet Calc","Base","Efficient","14-Digit","UPC"]
[{"$f":"IF(E2=0,\"\",1)","v":""},"32oz PET","REVV®","REVV® 32oz Coffee Concentrate",null,"5000376751","REVV® 32oz Coffee Concentrate",6,"32 OZ","CS",1,100,null,87,87,"10611247400996","611247400999"]
[{"$f":"IF(E3=0,\"\",1+MAX($A$2:A2))","v":""},"32oz PET","REVV®","REVV® 32oz Vanilla Coffee Concentrate",null,"5000384301","REVV® 32oz Vanilla Coffee Concentrate",6,"32 OZ","CS",1,100,null,93,93,"10611247406073","611247406076"]
[{"$f":"IF(E4=0,\"\",1+MAX($A$2:A3))","v":""},"32oz PET","The Original Donut Shop®","The Original Donut Shop® Coffee Concentrate, Regular, 32oz",null,"5000384299","The Original Donut Shop® Coffee Concentrate, Regular, 32oz",6,"32 OZ","CS",1,100,null,99,99,"10611247406059","611247406052"]
[{"$f":"IF(E5=0,\"\",1+MAX($A$2:A4))","v":""},"Accessories","Keurig®","Keurig® K-Suite® Coffee Tray ",null,"5000384134","Keurig® K-Suite® Coffee Tray ",null,10,"CS",1,null,null,149.9,149.9,"10611247405984","611247405987"]
[{"$f":"IF(E6=0,\"\",1+MAX($A$2:A5))","v":""},"Accessories","Keurig®","Keurig K-Cup Pod Deep Cleaning Kit",null,"5000359703","Keurig K-Cup Pod Deep Cleaning Kit",0,null,"EA",1,"80",null,49.99,49.99,"10611247390433","611247390436"]
[{"$f":"IF(E7=0,\"\",1+MAX($A$2:A6))","v":""},"Accessories","Keurig®","Keurig Bean to Cup Deep Cleaning Kit",null,"5000359701","Keurig Bean to Cup Deep Cleaning Kit",0,null,"EA",1,"104",null,64.989999999999995,64.989999999999995,"10611247390419","611247390412"]
[{"$f":"IF(E8=0,\"\",1+MAX($A$2:A7))","v":""},"Accessories","Keurig®","Keurig® Rinse Pods - 6, 10-ct boxes/case",null,"5000330357","Keurig® Rinse Pods - 6, 10-ct boxes/case",6,10,"CS",1,7,null,27.54,27.54,"10611247353414","611247353417"]
[{"$f":"IF(E9=0,\"\",1+MAX($A$2:A8))","v":""},"Accessories","Keurig®","K-Cup® Wire Mesh Display Rack - 4-sleeve ",null,"5000202739","K-Cup® Wire Mesh Display Rack - 4-sleeve ",1,null,"CS",1,33,null,30,30,"10611247375829","611247375822"]
[{"$f":"IF(E10=0,\"\",1+MAX($A$2:A9))","v":""},"Accessories","Keurig®","Keurig® Water Filter Refill Cartridges, 2 count* - 12/case",null,"5000367642","Keurig® Water Filter Refill Cartridges, 2 count* - 12/case",12,2,"CS",1,240,null,60.72,60.72,"10649645050840","649645050843"]
[{"$f":"IF(E11=0,\"\",1+MAX($A$2:A10))","v":""},"Accessories","Keurig®","KIT WATER FILTER OMNIPURE KQ8A",null,"5000052788","KIT WATER FILTER OMNIPURE KQ8A",1,1,"CS",1,224,null,48.37,48.37,null,"99555055726"]
[{"$f":"IF(E12=0,\"\",1+MAX($A$2:A11))","v":""},"Accessories","Keurig®","PREMIUM MODULAR MERCHANDISER 8CT",null,"5000380139","PREMIUM MODULAR MERCHANDISER 8CT",1,null,"CS",1,8,null,99.99,60,"10611247402976","611247402979"]
[{"$f":"IF(E13=0,\"\",1+MAX($A$2:A12))","v":""},"Accessories","Keurig®","PREMIUM MODULAR MERCHANDISER 12CT",null,"5000380140","PREMIUM MODULAR MERCHANDISER 12CT",1,null,"CS",1,4,null,129.99,75,"10611247402983","611247402986"]
[{"$f":"IF(E14=0,\"\",1+MAX($A$2:A13))","v":""},"Accessories","Keurig®","Keurig® Water Filter Refill Cartridges - 6/case",null,"5000367711","Keurig® Water Filter Refill Cartridges - 6/case",6,6,"CS",1,240,null,84.24,84.24,"10649645050734","649645050737"]
[{"$f":"IF(E15=0,\"\",1+MAX($A$2:A14))","v":""},"Accessories","Keurig®","K-Cup® 36-ct. Carousel - 1 per case",null,"5000199363","K-Cup® 36-ct. Carousel - 1 per case",1,1,"EA",1,"150",null,17.37,17.37,"10611247368418","6112247368411"]
[{"$f":"IF(E16=0,\"\",1+MAX($A$2:A15))","v":""},"Accessories","Keurig®","Keurig Descaling Solutoin - 6/case",null,"5000367641","Keurig Descaling Solutoin - 6/case",6,null,"CS",1,"250",null,46.32,46.32,"10649645405794","649645405797"]
[{"$f":"IF(E17=0,\"\",1+MAX($A$2:A16))","v":""},"Accessories","REVV","REVV Cold Coffee Pitcher 6:1",null,"5000380495","REVV Cold Coffee Pitcher 6:1",4,null,"EA",1,54,null,120,120,"10611247403140","611247403143"]
[{"$f":"IF(E18=0,\"\",1+MAX($A$2:A17))","v":""},"Accessories","Green Mountain Coffee Roasters®","CUP GMCR SOLO 10OZ 1000UN",null,"5000363812","CUP GMCR SOLO 10OZ 1000UN",1000,null,"CS",1,28,null,68.989999999999995,68.989999999999995,"41594354124","611247392140"]
[{"$f":"IF(E19=0,\"\",1+MAX($A$2:A18))","v":""},"Accessories","Green Mountain Coffee Roasters®","CUP GMCR SOLO 12OZ 1000UN",null,"5000363813","CUP GMCR SOLO 12OZ 1000UN",1000,null,"CS",1,28,null,56.448,56.448,"41594354186","611247392157"]
[{"$f":"IF(E20=0,\"\",1+MAX($A$2:A19))","v":""},"Accessories","Green Mountain Coffee Roasters®","CUP GMCR SOLO 16OZ 1000UN",null,"5000363814","CUP GMCR SOLO 16OZ 1000UN",1000,null,"CS",1,14,null,68.992000000000004,68.992000000000004,"41594354193","611247392164"]
[{"$f":"IF(E21=0,\"\",1+MAX($A$2:A20))","v":""},"Accessories","Green Mountain Coffee Roasters®","CUP GMCR SOLO 20OZ 600UN",null,"5000363815","CUP GMCR SOLO 20OZ 600UN",600,null,"CS",1,36,null,46.099200000000003,46.099200000000003,"41594354209","611247392171"]
[{"$f":"IF(E22=0,\"\",1+MAX($A$2:A21))","v":""},"Accessories","Green Mountain Coffee Roasters®","CUP GMCR SOLO 24OZ 500UN",null,"5000363816","CUP GMCR SOLO 24OZ 500UN",500,null,"CS",1,28,null,47.040000000000006,47.040000000000006,"41594354223","611247392188"]
[{"$f":"IF(E23=0,\"\",1+MAX($A$2:A22))","v":""},"Accessories","Keurig®","LID DOME FOR HOT PAPER CUPS 1000UN",null,"5000363875","LID DOME FOR HOT PAPER CUPS 1000UN",1000,null,"CS",1,48,null,25.088000000000001,25.088000000000001,"41165249286","611247392218"]
[{"$f":"IF(E24=0,\"\",1+MAX($A$2:A23))","v":""},"Accessories","Green Mountain Coffee Roasters®","GMCR CUP SLEEVES 1500/CS 2022",null,"5000370359","GMCR CUP SLEEVES 1500/CS 2022",1500,1500,"CS",1,63,null,48.38,48.38,"10611247398002","611247398005"]
[{"$f":"IF(E25=0,\"\",1+MAX($A$2:A24))","v":""},"Accessories","Green Mountain Coffee Roasters®","Green Mountain Coffee Roasters - 16-18-oz. Cold Cups - 1,000/case",null,"5000054210","Green Mountain Coffee Roasters - 16-18-oz. Cold Cups - 1,000/case",1000,"16 OZ","CS",1,24,null,129.92000000000002,128.30899200000002,"10611247356545","49202630486"]
[{"$f":"IF(E26=0,\"\",1+MAX($A$2:A25))","v":""},"Accessories","Green Mountain Coffee Roasters®","Green Mountain Coffee Roasters -  24-oz. Cold Cups - 600/case",null,"5000054212","Green Mountain Coffee Roasters -  24-oz. Cold Cups - 600/case",600,"24 OZ","CS",1,30,null,103.04,101.76230400000001,"49202681891"]
[{"$f":"IF(E27=0,\"\",1+MAX($A$2:A26))","v":""},"Accessories","Green Mountain Coffee Roasters®","Green Mountain Coffee Roasters - Domed Lid for Cold Cups - 1,000/case",null,"5000054213","Green Mountain Coffee Roasters - Domed Lid for Cold Cups - 1,000/case",1000,null,"CS",1,48,null,51.52,50.881152000000007,"49202013180"]
[{"$f":"IF(E28=0,\"\",1+MAX($A$2:A27))","v":""},"Accessories","Green Mountain Coffee Roasters®","Green Mountain Coffee Roasters - Flat Lids for Cold Cups - 1,000/case",null,"5000054211","Green Mountain Coffee Roasters - Flat Lids for Cold Cups - 1,000/case",1000,null,"CS",1,30,null,36.400000000000006,35.948640000000005,"49202012114","49202012114"]
[{"$f":"IF(E29=0,\"\",1+MAX($A$2:A28))","v":""},"Accessories","Keurig®","Airpot 2-pot rack",null,"5000053435","Airpot 2-pot rack",1,null,"EA",1,32,null,57,56.29,"10099555683285","99555683288"]
[{"$f":"IF(E30=0,\"\",1+MAX($A$2:A29))","v":""},"Accessories","Keurig®","Airpot 4-pot rack ",null,"5000053433","Airpot 4-pot rack ",1,null,"EA",1,32,null,69,68.14,"10099555683254","99555683257"]
{"$rows_left_out":868}